Caffe编译错误:Makefile:619

译caffe-SSD时,准备编译caffe遇到整屏幕的错误

错误描述是Makefile:619: recipe for target '.build_release/tools/upgrade_net_proto_binary.bin'

CXX/LD -o .build_release/tools/net_speed_benchmark.bin
CXX/LD -o .build_release/tools/caffe.bin
CXX/LD -o .build_release/tools/device_query.bin
CXX/LD -o .build_release/tools/convert_imageset.bin
CXX/LD -o .build_release/tools/finetune_net.bin
CXX/LD -o .build_release/tools/train_net.bin
CXX/LD -o .build_release/tools/upgrade_net_proto_binary.bin
CXX/LD -o .build_release/tools/compute_image_mean.bin
CXX/LD -o .build_release/tools/upgrade_net_proto_text.bin
CXX/LD -o .build_release/tools/get_image_size.bin
CXX/LD -o .build_release/tools/extract_features.bin
CXX/LD -o .build_release/tools/convert_annoset.bin
.build_release/lib/libcaffe.so: undefined reference to `boost::re_detail::cpp_regex_traits_implementation<char>::transform_primary(char const*, char const*) const'
.build_release/lib/libcaffe.so: undefined reference to `boost::re_detail::cpp_regex_traits_implementation<char>::transform(char const*, char const*) const'
.build_release/lib/libcaffe.so: undefined reference to `boost::match_results<__gnu_cxx::__normal_iterator<char const*, std::__cxx11::basic_string<char, std::char_traits<char>, std::allocator<char> > >, std::allocator<boost::sub_match<__gnu_cxx::__normal_iterator<char const*, std::__cxx11::basic_string<char, std::char_traits<char>, std::allocator<char> > > > > >::maybe_assign(boost::match_results<__gnu_cxx::__normal_iterator<char const*, std::__cxx11::basic_string<char, std::char_traits<char>, std::allocator<char> > >, std::allocator<boost::sub_match<__gnu_cxx::__normal_iterator<char const*, std::__cxx11::basic_string<char, std::char_traits<char>, std::allocator<char> > > > > > const&)'
.build_release/lib/libcaffe.so: undefined reference to `boost::re_detail::put_mem_block(void*)'
.build_release/lib/libcaffe.so: undefined reference to `boost::re_detail::get_mem_block()'
.build_release/lib/libcaffe.so: undefined reference to `boost::basic_regex<char, boost::regex_traits<char, boost::cpp_regex_traits<char> > >::do_assign(char const*, char const*, unsigned int)'
.build_release/lib/libcaffe.so: undefined reference to `boost::re_detail::raise_runtime_error(std::runtime_error const&)'
.build_release/lib/libcaffe.so: undefined reference to `boost::cpp_regex_traits<char>::toi(char const*&, char const*, int) const'
.build_release/lib/libcaffe.so: undefined reference to `boost::re_detail::perl_matcher<__gnu_cxx::__normal_iterator<char const*, std::__cxx11::basic_string<char, std::char_traits<char>, std::allocator<char> > >, std::allocator<boost::sub_match<__gnu_cxx::__normal_iterator<char const*, std::__cxx11::basic_string<char, std::char_traits<char>, std::allocator<char> > > > >, boost::regex_traits<char, boost::cpp_regex_traits<char> > >::construct_init(boost::basic_regex<char, boost::regex_traits<char, boost::cpp_regex_traits<char> > > const&, boost::regex_constants::_match_flags)'
.build_release/lib/libcaffe.so: undefined reference to `boost::re_detail::verify_options(unsigned int, boost::regex_constants::_match_flags)'
.build_release/lib/libcaffe.so: undefined reference to `boost::re_detail::get_default_error_string(boost::regex_constants::error_type)'
collect2: error: ld returned 1 exit status
Makefile:619: recipe for target '.build_release/tools/upgrade_net_proto_binary.bin' failed
make: *** [.build_release/tools/upgrade_net_proto_binary.bin] Error 1
make: *** Waiting for unfinished jobs....
.build_release/lib/libcaffe.so: undefined reference to `boost::re_detail::cpp_regex_traits_implementation<char>::transform_primary(char const*, char const*) const'
.build_release/lib/libcaffe.so: undefined reference to `boost::re_detail::cpp_regex_traits_implementation<char>::transform(char const*, char const*) const'
.build_release/lib/libcaffe.so: undefined reference to `boost::match_results<__gnu_cxx::__normal_iterator<char const*, std::__cxx11::basic_string<char, std::char_traits<char>, std::allocator<char> > >, std::allocator<boost::sub_match<__gnu_cxx::__normal_iterator<char const*, std::__cxx11::basic_string<char, std::char_traits<char>, std::allocator<char> > > > > >::maybe_assign(boost::match_results<__gnu_cxx::__normal_iterator<char const*, std::__cxx11::basic_string<char, std::char_traits<char>, std::allocator<char> > >, std::allocator<boost::sub_match<__gnu_cxx::__normal_iterator<char const*, std::__cxx11::basic_string<char, std::char_traits<char>, std::allocator<char> > > > > > const&)'
.build_release/lib/libcaffe.so: undefined reference to `boost::re_detail::put_mem_block(void*)'
.build_release/lib/libcaffe.so: undefined reference to `boost::re_detail::get_mem_block()'
.build_release/lib/libcaffe.so: undefined reference to `boost::basic_regex<char, boost::regex_traits<char, boost::cpp_regex_traits<char> > >::do_assign(char const*, char const*, unsigned int)'
.build_release/lib/libcaffe.so: undefined reference to `boost::re_detail::raise_runtime_error(std::runtime_error const&)'
.build_release/lib/libcaffe.so: undefined reference to `boost::cpp_regex_traits<char>::toi(char const*&, char const*, int) const'
.build_release/lib/libcaffe.so: undefined reference to `boost::re_detail::perl_matcher<__gnu_cxx::__normal_iterator<char const*, std::__cxx11::basic_string<char, std::char_traits<char>, std::allocator<char> > >, std::allocator<boost::sub_match<__gnu_cxx::__normal_iterator<char const*, std::__cxx11::basic_string<char, std::char_traits<char>, std::allocator<char> > > > >, boost::regex_traits<char, boost::cpp_regex_traits<char> > >::construct_init(boost::basic_regex<char, boost::regex_traits<char, boost::cpp_regex_traits<char> > > const&, boost::regex_constants::_match_flags)'
.build_release/lib/libcaffe.so: undefined reference to `boost::re_detail::verify_options(unsigned int, boost::regex_constants::_match_flags)'
.build_release/lib/libcaffe.so: undefined reference to `boost::re_detail::get_default_error_string(boost::regex_constants::error_type)'
collect2: error: ld returned 1 exit status
Makefile:619: recipe for target '.build_release/tools/convert_imageset.bin' failed
make: *** [.build_release/tools/convert_imageset.bin] Error 1
.build_release/lib/libcaffe.so: undefined reference to `boost::re_detail::cpp_regex_traits_implementation<char>::transform_primary(char const*, char const*) const'
.build_release/lib/libcaffe.so: undefined reference to `boost::re_detail::cpp_regex_traits_implementation<char>::transform(char const*, char const*) const'
.build_release/lib/libcaffe.so: undefined reference to `boost::match_results<__gnu_cxx::__normal_iterator<char const*, std::__cxx11::basic_string<char, std::char_traits<char>, std::allocator<char> > >, std::allocator<boost::sub_match<__gnu_cxx::__normal_iterator<char const*, std::__cxx11::basic_string<char, std::char_traits<char>, std::allocator<char> > > > > >::maybe_assign(boost::match_results<__gnu_cxx::__normal_iterator<char const*, std::__cxx11::basic_string<char, std::char_traits<char>, std::allocator<char> > >, std::allocator<boost::sub_match<__gnu_cxx::__normal_iterator<char const*, std::__cxx11::basic_string<char, std::char_traits<char>, std::allocator<char> > > > > > const&)'
.build_release/lib/libcaffe.so: undefined reference to `boost::re_detail::put_mem_block(void*)'
.build_release/lib/libcaffe.so: undefined reference to `boost::re_detail::get_mem_block()'
.build_release/lib/libcaffe.so: undefined reference to `boost::basic_regex<char, boost::regex_traits<char, boost::cpp_regex_traits<char> > >::do_assign(char const*, char const*, unsigned int)'
.build_release/lib/libcaffe.so: undefined reference to `boost::re_detail::raise_runtime_error(std::runtime_error const&)'
.build_release/lib/libcaffe.so: undefined reference to `boost::cpp_regex_traits<char>::toi(char const*&, char const*, int) const'
.build_release/lib/libcaffe.so: undefined reference to `boost::re_detail::perl_matcher<__gnu_cxx::__normal_iterator<char const*, std::__cxx11::basic_string<char, std::char_traits<char>, std::allocator<char> > >, std::allocator<boost::sub_match<__gnu_cxx::__normal_iterator<char const*, std::__cxx11::basic_string<char, std::char_traits<char>, std::allocator<char> > > > >, boost::regex_traits<char, boost::cpp_regex_traits<char> > >::construct_init(boost::basic_regex<char, boost::regex_traits<char, boost::cpp_regex_traits<char> > > const&, boost::regex_constants::_match_flags)'
.build_release/lib/libcaffe.so: undefined reference to `boost::re_detail::verify_options(unsigned int, boost::regex_constants::_match_flags)'
.build_release/lib/libcaffe.so: undefined reference to `boost::re_detail::get_default_error_string(boost::regex_constants::error_type)'
collect2: error: ld returned 1 exit status
Makefile:619: recipe for target '.build_release/tools/compute_image_mean.bin' failed
make: *** [.build_release/tools/compute_image_mean.bin] Error 1
.build_release/lib/libcaffe.so: undefined reference to `boost::re_detail::cpp_regex_traits_implementation<char>::transform_primary(char const*, char const*) const'
.build_release/lib/libcaffe.so: undefined reference to `boost::re_detail::cpp_regex_traits_implementation<char>::transform(char const*, char const*) const'
.build_release/lib/libcaffe.so: undefined reference to `boost::match_results<__gnu_cxx::__normal_iterator<char const*, std::__cxx11::basic_string<char, std::char_traits<char>, std::allocator<char> > >, std::allocator<boost::sub_match<__gnu_cxx::__normal_iterator<char const*, std::__cxx11::basic_string<char, std::char_traits<char>, std::allocator<char> > > > > >::maybe_assign(boost::match_results<__gnu_cxx::__normal_iterator<char const*, std::__cxx11::basic_string<char, std::char_traits<char>, std::allocator<char> > >, std::allocator<boost::sub_match<__gnu_cxx::__normal_iterator<char const*, std::__cxx11::basic_string<char, std::char_traits<char>, std::allocator<char> > > > > > const&)'
.build_release/lib/libcaffe.so: undefined reference to `boost::re_detail::put_mem_block(void*)'
.build_release/lib/libcaffe.so: undefined reference to `boost::re_detail::get_mem_block()'
.build_release/lib/libcaffe.so: undefined reference to `boost::basic_regex<char, boost::regex_traits<char, boost::cpp_regex_traits<char> > >::do_assign(char const*, char const*, unsigned int)'
.build_release/lib/libcaffe.so: undefined reference to `boost::re_detail::raise_runtime_error(std::runtime_error const&)'
.build_release/lib/libcaffe.so: undefined reference to `boost::cpp_regex_traits<char>::toi(char const*&, char const*, int) const'
.build_release/lib/libcaffe.so: undefined reference to `boost::re_detail::perl_matcher<__gnu_cxx::__normal_iterator<char const*, std::__cxx11::basic_string<char, std::char_traits<char>, std::allocator<char> > >, std::allocator<boost::sub_match<__gnu_cxx::__normal_iterator<char const*, std::__cxx11::basic_string<char, std::char_traits<char>, std::allocator<char> > > > >, boost::regex_traits<char, boost::cpp_regex_traits<char> > >::construct_init(boost::basic_regex<char, boost::regex_traits<char, boost::cpp_regex_traits<char> > > const&, boost::regex_constants::_match_flags)'
.build_release/lib/libcaffe.so: undefined reference to `boost::re_detail::verify_options(unsigned int, boost::regex_constants::_match_flags)'
.build_release/lib/libcaffe.so: undefined reference to `boost::re_detail::get_default_error_string(boost::regex_constants::error_type)'
collect2: error: ld returned 1 exit status
Makefile:619: recipe for target '.build_release/tools/caffe.bin' failed
make: *** [.build_release/tools/caffe.bin] Error 1
.build_release/lib/libcaffe.so: undefined reference to `boost::re_detail::cpp_regex_traits_implementation<char>::transform_primary(char const*, char const*) const'
.build_release/lib/libcaffe.so: undefined reference to `boost::re_detail::cpp_regex_traits_implementation<char>::transform(char const*, char const*) const'
.build_release/lib/libcaffe.so: undefined reference to `boost::match_results<__gnu_cxx::__normal_iterator<char const*, std::__cxx11::basic_string<char, std::char_traits<char>, std::allocator<char> > >, std::allocator<boost::sub_match<__gnu_cxx::__normal_iterator<char const*, std::__cxx11::basic_string<char, std::char_traits<char>, std::allocator<char> > > > > >::maybe_assign(boost::match_results<__gnu_cxx::__normal_iterator<char const*, std::__cxx11::basic_string<char, std::char_traits<char>, std::allocator<char> > >, std::allocator<boost::sub_match<__gnu_cxx::__normal_iterator<char const*, std::__cxx11::basic_string<char, std::char_traits<char>, std::allocator<char> > > > > > const&)'
.build_release/lib/libcaffe.so: undefined reference to `boost::re_detail::put_mem_block(void*)'
.build_release/lib/libcaffe.so: undefined reference to `boost::re_detail::get_mem_block()'
.build_release/lib/libcaffe.so: undefined reference to `boost::basic_regex<char, boost::regex_traits<char, boost::cpp_regex_traits<char> > >::do_assign(char const*, char const*, unsigned int)'
.build_release/lib/libcaffe.so: undefined reference to `boost::re_detail::raise_runtime_error(std::runtime_error const&)'
.build_release/lib/libcaffe.so: undefined reference to `boost::cpp_regex_traits<char>::toi(char const*&, char const*, int) const'
.build_release/lib/libcaffe.so: undefined reference to `boost::re_detail::perl_matcher<__gnu_cxx::__normal_iterator<char const*, std::__cxx11::basic_string<char, std::char_traits<char>, std::allocator<char> > >, std::allocator<boost::sub_match<__gnu_cxx::__normal_iterator<char const*, std::__cxx11::basic_string<char, std::char_traits<char>, std::allocator<char> > > > >, boost::regex_traits<char, boost::cpp_regex_traits<char> > >::construct_init(boost::basic_regex<char, boost::regex_traits<char, boost::cpp_regex_traits<char> > > const&, boost::regex_constants::_match_flags)'
.build_release/lib/libcaffe.so: undefined reference to `boost::re_detail::verify_options(unsigned int, boost::regex_constants::_match_flags)'
.build_release/lib/libcaffe.so: undefined reference to `boost::re_detail::get_default_error_string(boost::regex_constants::error_type)'
collect2: error: ld returned 1 exit status
Makefile:619: recipe for target '.build_release/tools/get_image_size.bin' failed
make: *** [.build_release/tools/get_image_size.bin] Error 1
.build_release/lib/libcaffe.so: undefined reference to `boost::re_detail::cpp_regex_traits_implementation<char>::transform_primary(char const*, char const*) const'
.build_release/lib/libcaffe.so: undefined reference to `boost::re_detail::cpp_regex_traits_implementation<char>::transform(char const*, char const*) const'
.build_release/lib/libcaffe.so: undefined reference to `boost::match_results<__gnu_cxx::__normal_iterator<char const*, std::__cxx11::basic_string<char, std::char_traits<char>, std::allocator<char> > >, std::allocator<boost::sub_match<__gnu_cxx::__normal_iterator<char const*, std::__cxx11::basic_string<char, std::char_traits<char>, std::allocator<char> > > > > >::maybe_assign(boost::match_results<__gnu_cxx::__normal_iterator<char const*, std::__cxx11::basic_string<char, std::char_traits<char>, std::allocator<char> > >, std::allocator<boost::sub_match<__gnu_cxx::__normal_iterator<char const*, std::__cxx11::basic_string<char, std::char_traits<char>, std::allocator<char> > > > > > const&)'
.build_release/lib/libcaffe.so: undefined reference to `boost::re_detail::put_mem_block(void*)'
.build_release/lib/libcaffe.so: undefined reference to `boost::re_detail::get_mem_block()'
.build_release/lib/libcaffe.so: undefined reference to `boost::basic_regex<char, boost::regex_traits<char, boost::cpp_regex_traits<char> > >::do_assign(char const*, char const*, unsigned int)'
.build_release/lib/libcaffe.so: undefined reference to `boost::re_detail::raise_runtime_error(std::runtime_error const&)'
.build_release/lib/libcaffe.so: undefined reference to `boost::cpp_regex_traits<char>::toi(char const*&, char const*, int) const'
.build_release/lib/libcaffe.so: undefined reference to `boost::re_detail::perl_matcher<__gnu_cxx::__normal_iterator<char const*, std::__cxx11::basic_string<char, std::char_traits<char>, std::allocator<char> > >, std::allocator<boost::sub_match<__gnu_cxx::__normal_iterator<char const*, std::__cxx11::basic_string<char, std::char_traits<char>, std::allocator<char> > > > >, boost::regex_traits<char, boost::cpp_regex_traits<char> > >::construct_init(boost::basic_regex<char, boost::regex_traits<char, boost::cpp_regex_traits<char> > > const&, boost::regex_constants::_match_flags)'
.build_release/lib/libcaffe.so: undefined reference to `boost::re_detail::verify_options(unsigned int, boost::regex_constants::_match_flags)'
.build_release/lib/libcaffe.so: undefined reference to `boost::re_detail::get_default_error_string(boost::regex_constants::error_type)'
collect2: error: ld returned 1 exit status
Makefile:619: recipe for target '.build_release/tools/upgrade_net_proto_text.bin' failed
make: *** [.build_release/tools/upgrade_net_proto_text.bin] Error 1
.build_release/lib/libcaffe.so: undefined reference to `boost::re_detail::cpp_regex_traits_implementation<char>::transform_primary(char const*, char const*) const'
.build_release/lib/libcaffe.so: undefined reference to `boost::re_detail::cpp_regex_traits_implementation<char>::transform(char const*, char const*) const'
.build_release/lib/libcaffe.so: undefined reference to `boost::match_results<__gnu_cxx::__normal_iterator<char const*, std::__cxx11::basic_string<char, std::char_traits<char>, std::allocator<char> > >, std::allocator<boost::sub_match<__gnu_cxx::__normal_iterator<char const*, std::__cxx11::basic_string<char, std::char_traits<char>, std::allocator<char> > > > > >::maybe_assign(boost::match_results<__gnu_cxx::__normal_iterator<char const*, std::__cxx11::basic_string<char, std::char_traits<char>, std::allocator<char> > >, std::allocator<boost::sub_match<__gnu_cxx::__normal_iterator<char const*, std::__cxx11::basic_string<char, std::char_traits<char>, std::allocator<char> > > > > > const&)'
.build_release/lib/libcaffe.so: undefined reference to `boost::re_detail::put_mem_block(void*)'
.build_release/lib/libcaffe.so: undefined reference to `boost::re_detail::get_mem_block()'
.build_release/lib/libcaffe.so: undefined reference to `boost::basic_regex<char, boost::regex_traits<char, boost::cpp_regex_traits<char> > >::do_assign(char const*, char const*, unsigned int)'
.build_release/lib/libcaffe.so: undefined reference to `boost::re_detail::raise_runtime_error(std::runtime_error const&)'
.build_release/lib/libcaffe.so: undefined reference to `boost::cpp_regex_traits<char>::toi(char const*&, char const*, int) const'
.build_release/lib/libcaffe.so: undefined reference to `boost::re_detail::perl_matcher<__gnu_cxx::__normal_iterator<char const*, std::__cxx11::basic_string<char, std::char_traits<char>, std::.allocatorbuild_release</charlib> > >,/ libcaffe.sostd:: :undefinedallocator <referenceboost :to: sub_match`<boost__gnu_cxx::::re_detail__normal_iterator:<:charcpp_regex_traits_implementation <constchar*>,: :stdtransform_primary:(:char__cxx11 :const:*basic_string,< char charconst,* )std :const:'char_traits
<.charbuild_release>/lib,/ libcaffe.sostd:: :undefinedallocator <referencechar to `>boost: :>re_detail: :> > cpp_regex_traits_implementation><,char >:boost::transform:(regex_traitschar< charconst,* ,boost :char: cpp_regex_traitsconst<*char)>  const>' 
>.:build_release/:libconstruct_init/(libcaffe.soboost:: undefined: basic_regexreference to <`charboost,: :match_results<boost__gnu_cxx::::regex_traits__normal_iterator<<charchar,  constboost*:,: cpp_regex_traitsstd<:char:> __cxx11>: :>basic_string <constchar&,,  std:boost::char_traits:<regex_constantschar:>:,_match_flags )std':
:.allocatorbuild_release</charlib> >/ libcaffe.so>:,  undefinedstd :reference: allocatorto `boost<:boost::re_detail::sub_match:<verify_options__gnu_cxx(:unsigned:__normal_iterator <intchar,  constboost*:,: regex_constantsstd::::__cxx11_match_flags:):'basic_string
<.char,build_release /stdlib:/:libcaffe.sochar_traits:< undefinedchar> ,reference std :to: allocator`<boostchar:>: > >re_detail > :>: >get_default_error_string:(:boostmaybe_assign:(:boostregex_constants::::match_resultserror_type<)__gnu_cxx':
:__normal_iterator<char const*, std::__cxx11::basic_string<char, std::char_traits<char>, std::allocator<char> > >, std::allocator<boost::sub_match<__gnu_cxx::__normal_iterator<char const*, std::__cxx11::collect2: error: ld returned 1 exit status
basic_string<char, std::char_traits<char>, std::allocator<char> > > > > > const&)'
.build_release/lib/libcaffe.so: undefined reference to `boost::re_detail::put_mem_block(void*)'
.build_release/lib/libcaffe.so: undefined reference to `boost::re_detail::get_mem_block()'
.build_release/lib/libcaffe.so: undefined reference to `boost::basic_regex<char, boost::regex_traits<char, boost::cpp_regex_traits<char> > >::do_assign(char const*, char const*, unsigned int)'
.build_release/lib/libcaffe.so: undefined reference to `boost::re_detail::raise_runtime_error(std::runtime_error const&)'
.build_release/lib/libcaffe.so: undefined reference to `boost::cpp_regex_traits<char>::toi(char const*&, char const*, int) const'
.build_release/lib/libcaffe.so: undefined reference to `boost::re_detail::perl_matcher<__gnu_cxx::__normal_iterator<char const*, std::__cxx11::basic_string<Makefile:619: recipe for target '.build_release/tools/extract_features.bin' failed
char, std::make: *** [.build_release/tools/extract_features.bin] Error 1
char_traits<char>, std::allocator<char> > >, std::allocator<boost::sub_match<__gnu_cxx::__normal_iterator<char const*, std::__cxx11::basic_string<char, std::char_traits<char>, std::allocator<char> > > > >, boost::regex_traits<char, boost::cpp_regex_traits<char> > >::construct_init(boost::basic_regex<char, boost::regex_traits<char, boost::cpp_regex_traits<char> > > const&, boost::regex_constants::_match_flags)'
.build_release/lib/libcaffe.so: undefined reference to `boost::re_detail::verify_options(unsigned int, boost::regex_constants::_match_flags)'
.build_release/lib/libcaffe.so: undefined reference to `boost::re_detail::get_default_error_string(boost::regex_constants::error_type)'
collect2: error: ld returned 1 exit status
Makefile:619: recipe for target '.build_release/tools/convert_annoset.bin' failed
make: *** [.build_release/tools/convert_annoset.bin] Error 1

解决方法

修改 Makefile文件

进入到下载的caffe目录

在 Makefile 文件中,按住crtl+f 搜索:stdc++

注意不是 Makefile.config!!!

添加 boost_regex 到 LIBRARIES += 的最后

即原来的:

LIBRARIES += boost_thread stdc++

现在变成:

LIBRARIES += boost_thread stdc++ boost_regex

重新make

注意 一定先make clean

否则,错误无法解除

重新`make && make distribute

编译通过

点击刷新